Target
Beta-lactamase SHV-1
Ligand
BDBM50021959
Substrate
Meas. Tech.
ChEMBL_40707 (CHEMBL654919)
IC50
20.1±n/a nM
Citation
  TBA Bioorg Med Chem Lett 3:2247-2252 (1993)   
Target
Name:
Beta-lactamase SHV-1
Synonyms:
BLA1_KLEPN SHV-1 beta-lactamase shv1
Type:
Protein
Mol. Mass.:
31226.68
Organism:
Klebsiella pneumoniae (Enterobacteria)
Description:
4R3B
Residue:
286
  
Inhibitor
Name:
BDBM50021959
Synonyms:
CHEMBL777 US9120808, Clavulanic acid potassium salt clavulanic acid
Type:
Small organic molecule
Emp. Form.:
C8H9NO5
Mol. Mass.:
199.1608
SMILES:
OC\C=C1/O[C@@H]2CC(=O)N2[C@H]1C(O)=O
: