Target
Alpha-1B adrenergic receptor
Ligand
BDBM50213029
Substrate
Meas. Tech.
ChEMBL_34490 (CHEMBL647202)
Ki
3236±n/a nM
Citation
  TBA Bioorg Med Chem Lett 5:2255-2258 (1995)   
Target
Name:
Alpha-1B adrenergic receptor
Synonyms:
ADA1B_HUMAN Adrenergic alpha1B Adrenergic receptor alpha Alpha 1B-adrenoreceptor | Alpha-1B adrenergic receptor
Type:
Enzyme
Mol. Mass.:
56862.13
Organism:
Homo sapiens (Human)
Description:
P35368
Residue:
520
  
Inhibitor
Name:
BDBM50213029
Synonyms:
CHEMBL49395
Type:
Small organic molecule
Emp. Form.:
C11H11N5
Mol. Mass.:
213.2385
SMILES:
C1CN=C(Nc2ccc3nccnc3c2)N1
: