Target
Alpha-2B adrenergic receptor
Ligand
BDBM50213029
Substrate
Meas. Tech.
ChEMBL_33368 (CHEMBL645106)
Ki
219±n/a nM
Citation
  TBA Bioorg Med Chem Lett 5:2255-2258 (1995)   
Target
Name:
Alpha-2B adrenergic receptor
Synonyms:
ADA2B_HUMAN ADRA2L1 Adrenergic alpha2B Adrenergic receptor alpha Alpha-2 adrenergic receptor subtype C2 Alpha-2B adrenoreceptor | Alpha-2BAR
Type:
Enzyme
Mol. Mass.:
49964.20
Organism:
Homo sapiens (Human)
Description:
P18089
Residue:
450
  
Inhibitor
Name:
BDBM50213029
Synonyms:
CHEMBL49395
Type:
Small organic molecule
Emp. Form.:
C11H11N5
Mol. Mass.:
213.2385
SMILES:
C1CN=C(Nc2ccc3nccnc3c2)N1
: