Target
Alpha-2C adrenergic receptor
Ligand
BDBM50213029
Substrate
Meas. Tech.
ChEMBL_33664 (CHEMBL649245)
Ki
1413±n/a nM
Citation
  TBA Bioorg Med Chem Lett 5:2255-2258 (1995)   
Target
Name:
Alpha-2C adrenergic receptor
Synonyms:
ADA2C_HUMAN ADRA2L2 Adrenergic alpha2C Adrenergic receptor alpha Alpha-2 adrenergic receptor subtype C4 Alpha-2C adrenoreceptor | adrenergic, alpha-2C-, receptor [Homo sapiens]
Type:
Enzyme
Mol. Mass.:
49552.32
Organism:
Homo sapiens (Human)
Description:
P18825
Residue:
462
  
Inhibitor
Name:
BDBM50213029
Synonyms:
CHEMBL49395
Type:
Small organic molecule
Emp. Form.:
C11H11N5
Mol. Mass.:
213.2385
SMILES:
C1CN=C(Nc2ccc3nccnc3c2)N1
: