Target
Alpha-1A adrenergic receptor
Ligand
BDBM50213029
Substrate
Meas. Tech.
ChEMBL_33879 (CHEMBL643751)
Ki
18197±n/a nM
Citation
  TBA Bioorg Med Chem Lett 5:2255-2258 (1995)   
Target
Name:
Alpha-1A adrenergic receptor
Synonyms:
ADA1A_HUMAN ADRA1C Alpha 1A-adrenoceptor Alpha adrenergic receptor 1a Alpha-adrenergic receptor 1c adrenergic Alpha1 | adrenergic Alpha1C
Type:
Cell-surface receptors
Mol. Mass.:
51511.67
Organism:
Homo sapiens (Human)
Description:
P35348
Residue:
466
  
Inhibitor
Name:
BDBM50213029
Synonyms:
CHEMBL49395
Type:
Small organic molecule
Emp. Form.:
C11H11N5
Mol. Mass.:
213.2385
SMILES:
C1CN=C(Nc2ccc3nccnc3c2)N1
: