Target
DNA topoisomerase 2-alpha/2-beta
Ligand
BDBM87351
Substrate
Meas. Tech.
ChEMBL_208606 (CHEMBL812283)
EC50
720±n/a nM
Citation
  TBA Bioorg Med Chem Lett 5:1021-1026 (1995)   
Target
Name:
DNA topoisomerase 2-alpha/2-beta
Synonyms:
DNA topoisomerase II
Type:
Mol. Mass.:
Description:
ASSAY_ID of ChEMBL is 1821483
Components:
This complex has 2 components.
Component 1
Name:
DNA topoisomerase 2-alpha
Synonyms:
DNA topoisomerase 2-alpha DNA topoisomerase II (Topo II) DNA topoisomerase II, alpha isozyme TOP2A Topoisomerase I/II | Topoisomerase II alpha (HuTopoIIα)
Type:
Protein
Mol. Mass.:
174415.30
Organism:
Homo sapiens (Human)
Description:
P11388
Residue:
1531
  
Component 2
Name:
DNA topoisomerase 2-beta
Synonyms:
DNA topoisomerase II TOP2B | TOP2B_HUMAN
Type:
PROTEIN
Mol. Mass.:
183284.13
Organism:
Homo sapiens (Human)
Description:
ChEMBL_51583
Residue:
1626
  
Inhibitor
Name:
BDBM87351
Synonyms:
Amsacrine hydrochloride MLS002153376 N-[4-(acridin-9-ylamino)-3-methoxy-phenyl]methanesulfonamide;hydrochloride N-[4-(acridin-9-ylamino)-3-methoxyphenyl]methanesulfonamide;hydrochloride cid_148673 | m-AMSA
Type:
Small organic molecule
Emp. Form.:
C21H19N3O3S
Mol. Mass.:
393.459
SMILES:
COc1cc(NS(C)(=O)=O)ccc1Nc1c2ccccc2nc2ccccc12
: