Target
Integrin alpha-IIb/beta-3
Ligand
BDBM50215566
Substrate
Meas. Tech.
ChEMBL_215990 (CHEMBL818493)
IC50
1000±n/a nM
Citation
 van Maarseveen, JHden Hartog, JATipker, KReinders, JHBrakkee, JSchön, UKehrbach, WKruse, CG Design and synthesis of an orally active GPIIb/IIIa antagonist based on a phenylpiperazine scaffold. Bioorg Med Chem Lett 8:1531-6 (1998)  
Target
Name:
Integrin alpha-IIb/beta-3
Synonyms:
Glycoprotein IIb/IIIa
Type:
Mol. Mass.:
Description:
ASSAY_ID of EBI is 30109
Components:
This complex has 2 components.
Component 1
Name:
Integrin beta-3
Synonyms:
CD_antigen=CD61 GPIIIa ITGB3 Platelet membrane glycoprotein IIIa
Type:
Protein
Mol. Mass.:
87038.91
Organism:
Homo sapiens (Human)
Description:
P05106
Residue:
788
  
Component 2
Name:
Integrin alpha-IIb
Synonyms:
CD_antigen=CD41 GPIIb Glycoprotein IIb ITGA2B Integrin alpha-IIb heavy chain Integrin alpha-IIb light chain, form 2 Integrin alpha-V/beta-3 and alpha-IIb/beta 3 | Platelet membrane glycoprotein IIb
Type:
Protein
Mol. Mass.:
113354.85
Organism:
Homo sapiens (Human)
Description:
P08514
Residue:
1039
  
Inhibitor
Name:
BDBM50215566
Synonyms:
CHEMBL38741
Type:
Small organic molecule
Emp. Form.:
C21H26N4O3
Mol. Mass.:
382.4561
SMILES:
CC(C)(Oc1ccc(cc1)N1CCN(CC1)c1ccc(cc1)C(N)=N)C(O)=O
: