Target
Histamine H3 receptor
Ligand
BDBM50216734
Substrate
Meas. Tech.
ChEMBL_83628 (CHEMBL858407)
Ki
28±n/a nM
Citation
 Tozer, MJHarper, EAKalindjian, SBPether, MJShankley, NPWatt, GF From histamine to imidazolylalkyl-sulfonamides: the design of a novel series of histamine H3-receptor antagonists. Bioorg Med Chem Lett 9:1825-30 (1999)  
Target
Name:
Histamine H3 receptor
Synonyms:
HISTAMINE H3 HRH3_CAVPO | Histamine H3 receptor
Type:
Enzyme Catalytic Domain
Mol. Mass.:
48753.61
Organism:
GUINEA PIG
Description:
HISTAMINE H3 HRH3 GUINEA PIG::Q9JI35
Residue:
445
  
Inhibitor
Name:
BDBM50216734
Synonyms:
CHEMBL300704
Type:
Small organic molecule
Emp. Form.:
C13H23N3O2S
Mol. Mass.:
285.406
SMILES:
O=S(=O)(CCC1CCCCC1)NCCc1c[nH]cn1
: