Target
D(2) dopamine receptor
Ligand
BDBM50216985
Substrate
Meas. Tech.
ChEMBL_58467 (CHEMBL670398)
Ki
50±n/a nM
Citation
 Dubuffet, TNewman-Tancredi, ACussac, DAudinot, VLoutz, AMillan, MJLavielle, G Novel benzopyrano[3,4-c]pyrrole derivatives as potent and selective dopamine D3 receptor antagonist. Bioorg Med Chem Lett 9:2059-64 (1999)  
Target
Name:
D(2) dopamine receptor
Synonyms:
D(2) dopamine receptor DOPAMINE D2 Long DRD2 Dopamine D2 receptor Dopamine D2 receptor (D2R) Dopamine2-like | d2
Type:
Cell-surface receptors
Mol. Mass.:
50647.10
Organism:
Homo sapiens (Human)
Description:
P14416
Residue:
443
  
Inhibitor
Name:
BDBM50216985
Synonyms:
CHEMBL66080
Type:
Small organic molecule
Emp. Form.:
C29H29N3O2
Mol. Mass.:
451.5595
SMILES:
[H][C@@]12CN(CCCCNC(=O)c3ccc(cc3)-c3ccccc3)C[C@@]1([H])c1cc(ccc1OC2)C#N
: