Target
D(2) dopamine receptor
Ligand
BDBM50342716
Substrate
Meas. Tech.
ChEMBL_58467 (CHEMBL670398)
Ki
32±n/a nM
Citation
 Dubuffet, TNewman-Tancredi, ACussac, DAudinot, VLoutz, AMillan, MJLavielle, G Novel benzopyrano[3,4-c]pyrrole derivatives as potent and selective dopamine D3 receptor antagonist. Bioorg Med Chem Lett 9:2059-64 (1999)  
Target
Name:
D(2) dopamine receptor
Synonyms:
D(2) dopamine receptor DOPAMINE D2 Long DRD2 Dopamine D2 receptor Dopamine D2 receptor (D2R) Dopamine2-like | d2
Type:
Cell-surface receptors
Mol. Mass.:
50647.10
Organism:
Homo sapiens (Human)
Description:
P14416
Residue:
443
  
Inhibitor
Name:
BDBM50342716
Synonyms:
CHEMBL418671 N-{4-[2-((3aR,9bS)-8-Cyano-1,3a,4,9b-tetrahydro-3H-chromeno[3,4-c]pyrrol-2-yl)-ethyl]-phenyl}-acetamide
Type:
Small organic molecule
Emp. Form.:
C22H23N3O2
Mol. Mass.:
361.4369
SMILES:
CC(=O)Nc1ccc(CCN2C[C@@H]3COc4ccc(cc4[C@H]3C2)C#N)cc1
: