Target
D(3) dopamine receptor
Ligand
BDBM50217171
Substrate
Meas. Tech.
ChEMBL_62457 (CHEMBL679229)
Ki
2.5±n/a nM
Citation
 Austin, NEAvenell, KYBoyfield, IBranch, CLColdwell, MCHadley, MSJeffrey, PJohns, AJohnson, CNNash, DJRiley, GJSmith, SAStacey, RCStemp, GThewlis, KMVong, AK Novel 1,2,3,4-tetrahydroisoquinolines with high affinity and selectivity for the dopamine D3 receptor. Bioorg Med Chem Lett 9:179-84 (1999)  
Target
Name:
D(3) dopamine receptor
Synonyms:
DOPAMINE D3 DRD3_HUMAN Dopamine D3 receptor (D3) Dopamine receptor Dopamine receptor D3
Type:
Mol. Mass.:
44243.43
Organism:
Homo sapiens (Human)
Description:
Residue:
400
  
Inhibitor
Name:
BDBM50217171
Synonyms:
CHEMBL54777
Type:
Small organic molecule
Emp. Form.:
C29H30F3N3O5S
Mol. Mass.:
589.626
SMILES:
CNC(=O)c1ccc(cc1)-c1ccc(cc1)C(=O)NCCCCN1CCc2ccc(OS(=O)(=O)C(F)(F)F)cc2C1
: