Target
Phenylethanolamine N-methyltransferase
Ligand
BDBM50024824
Substrate
Meas. Tech.
ChEMBL_153318 (CHEMBL760054)
Ki
1.76E+4±n/a nM
Citation
 Grunewald, GLCaldwell, TMDahanukar, VHJalluri, RKCriscione, KR Comparative molecular field analysis (CoMFA) models of phenylethanolamine N-methyltransferase (PNMT) and the alpha2-adrenoceptor: the development of new, highly selective inhibitors of PNMT. Bioorg Med Chem Lett 9:481-6 (1999)  
Target
Name:
Phenylethanolamine N-methyltransferase
Synonyms:
Noradrenaline N-methyltransferase PNMT_BOVIN | PNMTase
Type:
Enzyme
Mol. Mass.:
30916.97
Organism:
Bos taurus (bovine)
Description:
Residue:
283
  
Inhibitor
Name:
BDBM50024824
Synonyms:
1,2,3,4-Tetrahydro-isoquinolin-5-ol | CHEMBL308021
Type:
Small organic molecule
Emp. Form.:
C9H11NO
Mol. Mass.:
149.1897
SMILES:
Oc1cccc2CNCCc12
: