Target
Phenylethanolamine N-methyltransferase
Ligand
BDBM50024831
Substrate
Meas. Tech.
ChEMBL_153318 (CHEMBL760054)
Ki
4.47E+3±n/a nM
Citation
 Grunewald, GLCaldwell, TMDahanukar, VHJalluri, RKCriscione, KR Comparative molecular field analysis (CoMFA) models of phenylethanolamine N-methyltransferase (PNMT) and the alpha2-adrenoceptor: the development of new, highly selective inhibitors of PNMT. Bioorg Med Chem Lett 9:481-6 (1999)  
Target
Name:
Phenylethanolamine N-methyltransferase
Synonyms:
Noradrenaline N-methyltransferase PNMT_BOVIN | PNMTase
Type:
Enzyme
Mol. Mass.:
30916.97
Organism:
Bos taurus (bovine)
Description:
Residue:
283
  
Inhibitor
Name:
BDBM50024831
Synonyms:
1,2,3,4-Tetrahydro-isoquinoline-6,7-diol | CHEMBL11862
Type:
Small organic molecule
Emp. Form.:
C9H11NO2
Mol. Mass.:
165.1891
SMILES:
Oc1cc2CCNCc2cc1O
: