Target
Phenylethanolamine N-methyltransferase
Ligand
BDBM13018
Substrate
Meas. Tech.
ChEMBL_153318 (CHEMBL760054)
Ki
2.82E+3±n/a nM
Citation
 Grunewald, GLCaldwell, TMDahanukar, VHJalluri, RKCriscione, KR Comparative molecular field analysis (CoMFA) models of phenylethanolamine N-methyltransferase (PNMT) and the alpha2-adrenoceptor: the development of new, highly selective inhibitors of PNMT. Bioorg Med Chem Lett 9:481-6 (1999)  
Target
Name:
Phenylethanolamine N-methyltransferase
Synonyms:
Noradrenaline N-methyltransferase PNMT_BOVIN | PNMTase
Type:
Enzyme
Mol. Mass.:
30916.97
Organism:
Bos taurus (bovine)
Description:
Residue:
283
  
Inhibitor
Name:
BDBM13018
Synonyms:
7-methanesulfonyl-1,2,3,4-tetrahydroisoquinoline CHEMBL27664
Type:
Small organic molecule
Emp. Form.:
C10H13NO2S
Mol. Mass.:
211.281
SMILES:
CS(=O)(=O)c1ccc2CCNCc2c1
: