Target
Estrogen receptor beta
Ligand
BDBM50218560
Substrate
Meas. Tech.
ChEMBL_66404 (CHEMBL677098)
IC50
2.9±n/a nM
Citation
 Christiansen, LBWenckens, MBury, PSGissel, BHansen, BSThorpe, SMJacobsen, PKanstrup, AJørgensen, ASNaerum, LWassermann, K Synthesis and biological evaluation of novel thio-substituted chromanes as high-affinity partial agonists for the estrogen receptor. Bioorg Med Chem Lett 12:17-9 (2002)  
Target
Name:
Estrogen receptor beta
Synonyms:
Estrogen receptor
Type:
Mol. Mass.:
Description:
ASSAY_ID of ChEMBL is 99778
Components:
This complex has 2 components.
Component 1
Name:
Estrogen receptor beta
Synonyms:
ER-beta ESR2_HUMAN Estradiol receptor beta (ERβ) Estrogen receptor (ER beta) Estrogen receptor beta (ER beta) NR3A2 estrogen beta
Type:
Protein
Mol. Mass.:
59238.43
Organism:
Homo sapiens (Human)
Description:
Q92731
Residue:
530
  
Component 2
Name:
Estrogen receptor
Synonyms:
ER ESR ESR1_HUMAN Estrogen receptor Estrogen receptor (ER-alpha) Estrogen receptor alpha (ER) Nuclear receptor subfamily 3 group A member 1
Type:
Protein
Mol. Mass.:
66230.44
Organism:
Homo sapiens (Human)
Description:
P03372
Residue:
595
  
Inhibitor
Name:
BDBM50218560
Synonyms:
CHEBI:34857 Moxestrol | R-2858
Type:
Small organic molecule
Emp. Form.:
C21H26O3
Mol. Mass.:
326.4293
SMILES:
[H][C@@]12CC[C@@](O)(C#C)[C@@]1(C)C[C@H](OC)[C@]1([H])c3ccc(O)cc3CC[C@@]21[H]
: