Target
5-hydroxytryptamine receptor 2A
Ligand
BDBM50130286
Substrate
Meas. Tech.
ChEMBL_2543 (CHEMBL616893)
Ki
1000±n/a nM
Citation
 Bromidge, SMClarke, SEKing, FDLovell, PJNewman, HRiley, GRoutledge, CSerafinowska, HTSmith, DRThomas, DR Bicyclic piperazinylbenzenesulphonamides are potent and selective 5-HT6 receptor antagonists. Bioorg Med Chem Lett 12:1357-60 (2002)  
Target
Name:
5-hydroxytryptamine receptor 2A
Synonyms:
5-HT-2 5-HT2A 5-hydroxytryptamine receptor 2A (5HT-2A) 5HT2A_HUMAN HTR2A | Serotonin receptor 2A
Type:
undefined
Mol. Mass.:
52607.65
Organism:
Homo sapiens (Human)
Description:
P28223
Residue:
471
  
Inhibitor
Name:
BDBM50130286
Synonyms:
5-Chloro-3-methyl-benzo[b]thiophene-2-sulfonic acid [4-methoxy-3-(4-methyl-piperazin-1-yl)-phenyl]-amide SB-258510
Type:
Small organic molecule
Emp. Form.:
C21H24ClN3O3S2
Mol. Mass.:
466.017
SMILES:
COc1ccc(NS(=O)(=O)c2sc3ccc(Cl)cc3c2C)cc1N1CCN(C)CC1
: