Target
Histone deacetylase (HDAC1 and HDAC2)
Ligand
BDBM50218242
Substrate
Meas. Tech.
ChEMBL_87537 (CHEMBL695135)
IC50
9.2±n/a nM
Citation
 Frey, RRWada, CKGarland, RBCurtin, MLMichaelides, MRLi, JPease, LJGlaser, KBMarcotte, PABouska, JJMurphy, SSDavidsen, SK Trifluoromethyl ketones as inhibitors of histone deacetylase. Bioorg Med Chem Lett 12:3443-7 (2002)  
Target
Name:
Histone deacetylase (HDAC1 and HDAC2)
Synonyms:
HDACs | Histone deacetylase 1/2
Type:
Mol. Mass.:
Description:
ASSAY_ID of ChEMBL is 2197604
Components:
This complex has 2 components.
Component 1
Name:
Histone deacetylase 1
Synonyms:
Cereblon/Histone deacetylase 1 HDAC1 Histone deacetylase 1 (HDAC1) RPD3L1
Type:
Enzyme
Mol. Mass.:
55090.27
Organism:
Homo sapiens (Human)
Description:
Q13547
Residue:
482
  
Component 2
Name:
Histone deacetylase 2
Synonyms:
Cereblon/Histone deacetylase 2 HDAC2 Histone deacetylase 2 (HDAC2) | Human HDAC2
Type:
Chromatin regulator; hydrolase; repressor
Mol. Mass.:
55356.54
Organism:
Homo sapiens (Human)
Description:
Q92769
Residue:
488
  
Inhibitor
Name:
BDBM50218242
Synonyms:
CHEMBL115812
Type:
Small organic molecule
Emp. Form.:
C20H22N2O3
Mol. Mass.:
338.4003
SMILES:
ONC(=O)CCCCCCOc1ccc(cc1)-c1ccc(cc1)C#N
: