Target
Histone deacetylase (HDAC1 and HDAC2)
Ligand
BDBM50220806
Substrate
Meas. Tech.
ChEMBL_87404 (CHEMBL693168)
IC50
6.5±n/a nM
Citation
 Dai, YGuo, YGuo, JPease, LJLi, JMarcotte, PAGlaser, KBTapang, PAlbert, DHRichardson, PLDavidsen, SKMichaelides, MR Indole amide hydroxamic acids as potent inhibitors of histone deacetylases. Bioorg Med Chem Lett 13:1897-901 (2003)  
Target
Name:
Histone deacetylase (HDAC1 and HDAC2)
Synonyms:
HDACs | Histone deacetylase 1/2
Type:
Mol. Mass.:
Description:
ASSAY_ID of ChEMBL is 2197604
Components:
This complex has 2 components.
Component 1
Name:
Histone deacetylase 1
Synonyms:
Cereblon/Histone deacetylase 1 HDAC1 Histone deacetylase 1 (HDAC1) RPD3L1
Type:
Enzyme
Mol. Mass.:
55090.27
Organism:
Homo sapiens (Human)
Description:
Q13547
Residue:
482
  
Component 2
Name:
Histone deacetylase 2
Synonyms:
Cereblon/Histone deacetylase 2 HDAC2 Histone deacetylase 2 (HDAC2) | Human HDAC2
Type:
Chromatin regulator; hydrolase; repressor
Mol. Mass.:
55356.54
Organism:
Homo sapiens (Human)
Description:
Q92769
Residue:
488
  
Inhibitor
Name:
BDBM50220806
Synonyms:
CHEMBL293812
Type:
Small organic molecule
Emp. Form.:
C17H23N3O4
Mol. Mass.:
333.3822
SMILES:
COc1ccc2[nH]c(cc2c1)C(=O)NCCCCCCC(=O)NO
: