Target
Histone deacetylase (HDAC1 and HDAC2)
Ligand
BDBM50222334
Substrate
Meas. Tech.
ChEMBL_87402 (CHEMBL693166)
IC50
9.8±n/a nM
Citation
 Dai, YGuo, YCurtin, MLLi, JPease, LJGuo, JMarcotte, PAGlaser, KBDavidsen, SKMichaelides, MR A novel series of histone deacetylase inhibitors incorporating hetero aromatic ring systems as connection units. Bioorg Med Chem Lett 13:3817-20 (2003)  
Target
Name:
Histone deacetylase (HDAC1 and HDAC2)
Synonyms:
HDACs | Histone deacetylase 1/2
Type:
Mol. Mass.:
Description:
ASSAY_ID of ChEMBL is 2197604
Components:
This complex has 2 components.
Component 1
Name:
Histone deacetylase 1
Synonyms:
Cereblon/Histone deacetylase 1 HDAC1 Histone deacetylase 1 (HDAC1) RPD3L1
Type:
Enzyme
Mol. Mass.:
55090.27
Organism:
Homo sapiens (Human)
Description:
Q13547
Residue:
482
  
Component 2
Name:
Histone deacetylase 2
Synonyms:
Cereblon/Histone deacetylase 2 HDAC2 Histone deacetylase 2 (HDAC2) | Human HDAC2
Type:
Chromatin regulator; hydrolase; repressor
Mol. Mass.:
55356.54
Organism:
Homo sapiens (Human)
Description:
Q92769
Residue:
488
  
Inhibitor
Name:
BDBM50222334
Synonyms:
CHEMBL127846
Type:
Small organic molecule
Emp. Form.:
C16H20N2O3
Mol. Mass.:
288.3416
SMILES:
ONC(=O)CCCCCCc1ncc(o1)-c1ccccc1
: