Target
Transient receptor potential cation channel subfamily V member 1/2/4
Ligand
BDBM50224175
Substrate
Meas. Tech.
ChEMBL_177039 (CHEMBL779560)
IC50
20±n/a nM
Citation
 Park, HGChoi, JYChoi, SHPark, MKLee, JSuh, YGCho, HOh, UKim, HDJoo, YHKim, SYPark, YHJeong, YSChoi, JKKim, JKJew, SS N-4-methansulfonamidobenzyl-N'-2-substituted-4-tert-butyl-benzyl thioureas as potent vanilloid receptor antagonistic ligands. Bioorg Med Chem Lett 14:1693-6 (2004)  
Target
Name:
Transient receptor potential cation channel subfamily V member 1/2/4
Synonyms:
Vanilloid receptor
Type:
Mol. Mass.:
Description:
ASSAY_ID of ChEMBL is 177578
Components:
This complex has 3 components.
Component 1
Name:
Transient receptor potential cation channel subfamily V member 2
Synonyms:
Sac2b Transient receptor potential cation channel subfamily V member 2 Vanilloid receptor | Vrl1
Type:
PROTEIN
Mol. Mass.:
86707.60
Organism:
Rattus norvegicus
Description:
ChEMBL_768011
Residue:
761
  
Component 2
Name:
Transient receptor potential cation channel subfamily V member 1
Synonyms:
Capsaicin receptor TRPV1_RAT Trpv1 Vanilloid VR1 Vanilloid receptor 1 (VRI/TRPV1) Vanilloid receptor type 1-like (TrpV1/Vr1) Vr1l | osm-9-like TRP channel 1
Type:
Transient Receptor
Mol. Mass.:
94956.12
Organism:
Rattus norvegicus (rat)
Description:
O35433
Residue:
838
  
Component 3
Name:
Transient receptor potential cation channel subfamily V member 4
Synonyms:
TRPV4_RAT Vanilloid receptor | Vroac
Type:
PROTEIN
Mol. Mass.:
98016.72
Organism:
Rattus norvegicus
Description:
ChEMBL_1514408
Residue:
871
  
Inhibitor
Name:
BDBM50224175
Synonyms:
CHEMBL48061
Type:
Small organic molecule
Emp. Form.:
C24H34FN3O3S2
Mol. Mass.:
495.673
SMILES:
CCCCOc1cc(ccc1C\N=C(/S)NCc1ccc(NS(C)(=O)=O)c(F)c1)C(C)(C)C
: