Target
Dihydrofolate reductase
Ligand
BDBM50405983
Substrate
Meas. Tech.
ChEMBL_54733 (CHEMBL668773)
Ki
525±n/a nM
Citation
 Li, RLDietrich, SWHansch, C Quantitative structure-selectivity relationships. Comparison of the inhibition of Escherichia coli and bovine liver dihydrofolate reductase by 5-(substituted-benzyl)-2,4-diaminopyrimidines. J Med Chem 24:538-44 (1981)  
Target
Name:
Dihydrofolate reductase
Synonyms:
Dihydrofolate reductase (F31V) | dfrA17
Type:
Mol. Mass.:
17532.46
Organism:
Escherichia coli
Description:
Residue:
157
  
Inhibitor
Name:
BDBM50405983
Synonyms:
CHEMBL32067
Type:
Small organic molecule
Emp. Form.:
C12H14N4O
Mol. Mass.:
230.2658
SMILES:
Nc1ncc(Cc2cccc(CO)c2)c(N)n1
: