Target
Dihydrofolate reductase
Ligand
BDBM50405983
Substrate
Meas. Tech.
ChEMBL_55072 (CHEMBL858271)
Ki
2138±n/a nM
Citation
 Hansch, CLi, RBlaney, JMLangridge, R Comparison of the inhibition of Escherichia coli and Lactobacillus casei dihydrofolate reductase by 2,4-diamino-5-(substituted-benzyl)pyrimidines: quantitative structure-activity relationships, X-ray crystallography, and computer graphics in structure-activity analysis. J Med Chem 25:777-84 (1982)  
Target
Name:
Dihydrofolate reductase
Synonyms:
DYR_LACCA folA
Type:
PROTEIN
Mol. Mass.:
18437.08
Organism:
Lactobacillus casei
Description:
ChEMBL_1357878
Residue:
163
  
Inhibitor
Name:
BDBM50405983
Synonyms:
CHEMBL32067
Type:
Small organic molecule
Emp. Form.:
C12H14N4O
Mol. Mass.:
230.2658
SMILES:
Nc1ncc(Cc2cccc(CO)c2)c(N)n1
: