Target
Prostaglandin G/H synthase 1/2
Ligand
BDBM50027952
Substrate
Meas. Tech.
ChEMBL_157966 (CHEMBL767496)
IC50
15000±n/a nM
Citation
 Walsh, DAMoran, HWShamblee, DAUwaydah, IMWelstead, WJSancilio, LFDannenburg, WN Antiinflammatory agents. 3. Synthesis and pharmacological evaluation of 2-amino-3-benzoylphenylacetic acid and analogues. J Med Chem 27:1379-88 (1984)  
Target
Name:
Prostaglandin G/H synthase 1/2
Synonyms:
Cyclooxygenase
Type:
Mol. Mass.:
Description:
ASSAY_ID of ChEMBL is 1570295
Components:
This complex has 2 components.
Component 1
Name:
Prostaglandin G/H synthase 2
Synonyms:
COX2 Cyclooxygenase-2 PGH2_BOVIN PHS II Prostaglandin H2 synthase 2 | Prostaglandin-endoperoxide synthase 2
Type:
PROTEIN
Mol. Mass.:
69173.20
Organism:
Bos taurus
Description:
ChEMBL_157990
Residue:
604
  
Component 2
Name:
Prostaglandin G/H synthase 1
Synonyms:
COX-1 Cyclooxygenase PGH1_BOVIN | PTGS1
Type:
PROTEIN
Mol. Mass.:
68814.10
Organism:
Bos taurus
Description:
ChEMBL_547440
Residue:
600
  
Inhibitor
Name:
BDBM50027952
Synonyms:
5-(4-chlorobenzoyl)-1,4-dimethyl-1H-pyrrole-2-acetic acid Zomepirac | [5-(4-chlorobenzoyl)-1,4-dimethyl-1H-pyrrol-2-yl]acetic acid
Type:
Small organic molecule
Emp. Form.:
C15H14ClNO3
Mol. Mass.:
291.73
SMILES:
Cc1cc(CC(O)=O)n(C)c1C(=O)c1ccc(Cl)cc1
: