Target
Dihydrofolate reductase
Ligand
BDBM50405072
Substrate
Meas. Tech.
ChEMBL_54084 (CHEMBL669981)
Ki
76±n/a nM
Citation
 Hathaway, BAGuo, ZRHansch, CDelcamp, TJSusten, SSFreisheim, JH Inhibition of human dihydrofolate reductase by 4,6-diamino-1,2-dihydro-2,2-dimethyl-1-(substituted-phenyl)-s-triazine s. A quantitative structure-activity relationship analysis. J Med Chem 27:144-9 (1984)  
Target
Name:
Dihydrofolate reductase
Synonyms:
DHFR Dihydrofolate reductase (DHFR) | Tetrahydrofolate dehydrogenase
Type:
Enzyme
Mol. Mass.:
21453.99
Organism:
Homo sapiens (Human)
Description:
Recombinant human DHFR.
Residue:
187
  
Inhibitor
Name:
BDBM50405072
Synonyms:
CHEMBL33010
Type:
Small organic molecule
Emp. Form.:
C19H23N5O2
Mol. Mass.:
353.4182
SMILES:
CC1(C)N=C(N)N=C(N)N1c1ccc(OCc2ccc(CO)cc2)cc1
: