Target
Dihydrofolate reductase
Ligand
BDBM50405983
Substrate
Meas. Tech.
ChEMBL_54735 (CHEMBL667186)
Ki
524±n/a nM
Citation
 Doweyko, AM The hypothetical active site lattice. An approach to modelling active sites from data on inhibitor molecules. J Med Chem 31:1396-406 (1988)  
Target
Name:
Dihydrofolate reductase
Synonyms:
Dihydrofolate reductase (F31V) | dfrA17
Type:
Mol. Mass.:
17532.46
Organism:
Escherichia coli
Description:
Residue:
157
  
Inhibitor
Name:
BDBM50405983
Synonyms:
CHEMBL32067
Type:
Small organic molecule
Emp. Form.:
C12H14N4O
Mol. Mass.:
230.2658
SMILES:
Nc1ncc(Cc2cccc(CO)c2)c(N)n1
: