Target
Phosphatidylinositol 4-kinase type 2-alpha
Ligand
BDBM50228485
Substrate
Meas. Tech.
ChEMBL_152907 (CHEMBL758630)
Ki
85800±n/a nM
Citation
 Young, RCJones, MMilliner, KJRana, KKWard, JG Purine derivatives as competitive inhibitors of human erythrocyte membrane phosphatidylinositol 4-kinase. J Med Chem 33:2073-80 (1990)  
Target
Name:
Phosphatidylinositol 4-kinase type 2-alpha
Synonyms:
P4K2A_HUMAN Phosphatidylinositol 4-kinase type 2-alpha | Phosphatidylinositol 4-kinase type II-alpha
Type:
PROTEIN
Mol. Mass.:
54030.26
Organism:
Homo sapiens (Human)
Description:
ChEMBL_104812
Residue:
479
  
Inhibitor
Name:
BDBM50228485
Synonyms:
CHEMBL539503
Type:
Small organic molecule
Emp. Form.:
C5H6ClN5
Mol. Mass.:
171.588
SMILES:
Cl.Nc1[nH]cnc2ncnc12
: