Target
Phosphatidylinositol 4-kinase type 2-alpha
Ligand
BDBM50228347
Substrate
Meas. Tech.
ChEMBL_152904 (CHEMBL758627)
IC50
134100±n/a nM
Citation
 Young, RCJones, MMilliner, KJRana, KKWard, JG Purine derivatives as competitive inhibitors of human erythrocyte membrane phosphatidylinositol 4-kinase. J Med Chem 33:2073-80 (1990)  
Target
Name:
Phosphatidylinositol 4-kinase type 2-alpha
Synonyms:
P4K2A_HUMAN Phosphatidylinositol 4-kinase type 2-alpha | Phosphatidylinositol 4-kinase type II-alpha
Type:
PROTEIN
Mol. Mass.:
54030.26
Organism:
Homo sapiens (Human)
Description:
ChEMBL_104812
Residue:
479
  
Inhibitor
Name:
BDBM50228347
Synonyms:
CHEMBL62334
Type:
Small organic molecule
Emp. Form.:
C12H19N5
Mol. Mass.:
233.3128
SMILES:
CCC(CC)(CC)n1cnc2c(N)ncnc12
: