Target
Coagulation factor XI
Ligand
BDBM50230339
Substrate
Meas. Tech.
ChEMBL_1644767 (CHEMBL3993696)
Ki
5.2±n/a nM
Citation
 Corte, JRFang, TOsuna, HPinto, DJRossi, KAMyers, JESheriff, SLou, ZZheng, JJHarper, TWBozarth, JMWu, YLuettgen, JMSeiffert, DADecicco, CPWexler, RRQuan, ML Structure-Based Design of Macrocyclic Factor XIa Inhibitors: Discovery of the Macrocyclic Amide Linker. J Med Chem 60:1060-1075 (2017)  
Target
Name:
Coagulation factor XI
Synonyms:
Coagulation factor XIa Coagulation factor XIa light chain FA11_HUMAN Factor XIa PTA | Plasma thromboplastin antecedent
Type:
Enzyme
Mol. Mass.:
70130.58
Organism:
Homo sapiens (Human)
Description:
P03951
Residue:
625
  
Inhibitor
Name:
BDBM50230339
Synonyms:
CHEMBL4098577
Type:
Small organic molecule
Emp. Form.:
C28H26ClN9O4
Mol. Mass.:
588.017
SMILES:
COC(=O)Nc1ccc2-c3c[nH]c(n3)[C@H](C\C=C/CCC(=O)Nc2c1)NC(=O)\C=C\c1cc(Cl)ccc1-n1cnnn1
: