Target
Glucose-dependent insulinotropic receptor
Ligand
BDBM50232625
Substrate
Meas. Tech.
ChEMBL_1648272 (CHEMBL3997328)
EC50
0.800000±n/a nM
Citation
 Zhu, CWang, LZhu, YGuo, ZZLiu, PHu, ZSzewczyk, JWKang, LChicchi, GEhrhardt, AWoods, ASeo, TWoods, Mvan Heek, MDingley, KHPang, JSalituro, GMPowell, JTerebetski, JLHornak, VCampeau, LCOrr, RKUjjainwalla, FMiller, MStamford, AWood, HBKowalski, TNargund, RPEdmondson, SD Discovery of phenyl acetamides as potent and selective GPR119 agonists. Bioorg Med Chem Lett 27:1124-1128 (2017)  
Target
Name:
Glucose-dependent insulinotropic receptor
Synonyms:
G-protein coupled receptor 119 (GPR119) GPR119 | Glucose-dependent insulinotropic receptor
Type:
Protein
Mol. Mass.:
36901.49
Organism:
Homo sapiens (Human)
Description:
Q8TDV5
Residue:
335
  
Inhibitor
Name:
BDBM50232625
Synonyms:
CHEMBL4080222
Type:
Small organic molecule
Emp. Form.:
C25H30ClFN4O3
Mol. Mass.:
488.982
SMILES:
OC1CN(C1)C(=O)Cc1ccc(OCC[C@@H]2C[C@@H]2C2CCN(CC2)c2ncc(Cl)cn2)cc1F
: