Target
Glucose-dependent insulinotropic receptor
Ligand
BDBM50232629
Substrate
Meas. Tech.
ChEMBL_1648272 (CHEMBL3997328)
EC50
0.700000±n/a nM
Citation
 Zhu, CWang, LZhu, YGuo, ZZLiu, PHu, ZSzewczyk, JWKang, LChicchi, GEhrhardt, AWoods, ASeo, TWoods, Mvan Heek, MDingley, KHPang, JSalituro, GMPowell, JTerebetski, JLHornak, VCampeau, LCOrr, RKUjjainwalla, FMiller, MStamford, AWood, HBKowalski, TNargund, RPEdmondson, SD Discovery of phenyl acetamides as potent and selective GPR119 agonists. Bioorg Med Chem Lett 27:1124-1128 (2017)  
Target
Name:
Glucose-dependent insulinotropic receptor
Synonyms:
G-protein coupled receptor 119 (GPR119) GPR119 | Glucose-dependent insulinotropic receptor
Type:
Protein
Mol. Mass.:
36901.49
Organism:
Homo sapiens (Human)
Description:
Q8TDV5
Residue:
335
  
Inhibitor
Name:
BDBM50232629
Synonyms:
CHEMBL4077033
Type:
Small organic molecule
Emp. Form.:
C27H35FN4O3
Mol. Mass.:
482.5902
SMILES:
COCc1cnc(nc1)N1CCC(CC1)[C@H]1C[C@H]1CCOc1ccc(CC(=O)N2CCC2)c(F)c1
: