Target
Glycine receptor subunit alpha-1
Ligand
BDBM50232896
Substrate
Meas. Tech.
ChEMBL_1649355 (CHEMBL3998489)
IC50
49±n/a nM
Citation
 Mohsen, AMMandour, YMSarukhanyan, EBreitinger, UVillmann, CBanoub, MMBreitinger, HGDandekar, THolzgrabe, USotriffer, CJensen, AAZlotos, DP Oxime Ethers of (E)-11-Isonitrosostrychnine as Highly Potent Glycine Receptor Antagonists. J Nat Prod 79:2997-3005 (2016)  
Target
Name:
Glycine receptor subunit alpha-1
Synonyms:
GLRA1 Glycine receptor 48 kDa subunit | Glycine receptor strychnine-binding subunit
Type:
Enzyme Catalytic Domain
Mol. Mass.:
52635.39
Organism:
Homo sapiens (Human)
Description:
P23415
Residue:
457
  
Inhibitor
Name:
BDBM50232896
Synonyms:
CHEMBL4079657
Type:
Small organic molecule
Emp. Form.:
C24H25N3O3
Mol. Mass.:
403.4736
SMILES:
[H][C@]12C[C@@]3([H])C4=CCO[C@@]5([H])\C(=N/OCC=C)C(=O)N6c7ccccc7[C@@]1(CCN2C4)[C@]6([H])[C@@]35[H]
: