Target
Glycine receptor subunit alpha-1/beta
Ligand
BDBM50225707
Substrate
Meas. Tech.
ChEMBL_1649356 (CHEMBL3998490)
IC50
58±n/a nM
Citation
 Mohsen, AMMandour, YMSarukhanyan, EBreitinger, UVillmann, CBanoub, MMBreitinger, HGDandekar, THolzgrabe, USotriffer, CJensen, AAZlotos, DP Oxime Ethers of (E)-11-Isonitrosostrychnine as Highly Potent Glycine Receptor Antagonists. J Nat Prod 79:2997-3005 (2016)  
Target
Name:
Glycine receptor subunit alpha-1/beta
Synonyms:
Glycine receptor (alpha-1/beta)
Type:
Mol. Mass.:
Description:
ASSAY_ID of ChEMBL is 2112032
Components:
This complex has 2 components.
Component 1
Name:
Glycine receptor subunit alpha-1
Synonyms:
GLRA1 Glycine receptor 48 kDa subunit | Glycine receptor strychnine-binding subunit
Type:
Enzyme Catalytic Domain
Mol. Mass.:
52635.39
Organism:
Homo sapiens (Human)
Description:
P23415
Residue:
457
  
Component 2
Name:
Glycine receptor subunit beta
Synonyms:
GLRB Glycine receptor 58 kDa subunit Glycine receptor subunit beta
Type:
PROTEIN
Mol. Mass.:
56135.64
Organism:
Homo sapiens (Human)
Description:
ChEMBL_117714
Residue:
497
  
Inhibitor
Name:
BDBM50225707
Synonyms:
CHEBI:28973 | Strychnine
Type:
Small organic molecule
Emp. Form.:
C21H22N2O2
Mol. Mass.:
334.4116
SMILES:
[H][C@]12C[C@@]3([H])C4=CCO[C@@]5([H])CC(=O)N6c7ccccc7[C@@]1(CCN2C4)[C@]6([H])[C@@]35[H]
: