Target
Prostaglandin D2 receptor 2
Ligand
BDBM50233524
Substrate
Meas. Tech.
ChEMBL_1650965 (CHEMBL4000099)
Ki
4±n/a nM
Citation
 Sandham, DABarker, LBrown, LBrown, ZBudd, DCharlton, SJChatterjee, DCox, BDubois, GDuggan, NHall, EHatto, JMaas, JManini, JProfit, RRiddy, DRitchie, CSohal, BShaw, DStringer, RSykes, DAThomas, MTurner, KLWatson, SJWest, RWillard, EWilliams, GWillis, J Discovery of Fevipiprant (NVP-QAW039), a Potent and Selective DP ACS Med Chem Lett 8:582-586 (2017)  
Target
Name:
Prostaglandin D2 receptor 2
Synonyms:
CD_antigen=CD294 Chemoattractant Receptor-homologous molecule expressed on T-helper type 2 cells (CRTH2) Chemoattractant receptor-homologous molecule expressed on Th2 cells (CRTH2) G protein-coupled receptor 44 GPR44 PTGDR2 Prostaglandin D2 receptor 2 | Prostaglandin D2 receptor 2 (PGD2)
Type:
Enzyme
Mol. Mass.:
43295.45
Organism:
Homo sapiens (Human)
Description:
Q9Y5Y4
Residue:
395
  
Inhibitor
Name:
BDBM50233524
Synonyms:
CHEMBL3981414
Type:
Small organic molecule
Emp. Form.:
C18H17ClN2O4S
Mol. Mass.:
392.857
SMILES:
Cc1c(CC(O)=O)c2cccnc2n1Cc1ccc(cc1Cl)S(C)(=O)=O
: