Target
Oxytocin receptor
Ligand
BDBM50380759
Substrate
Meas. Tech.
ChEMBL_1651553 (CHEMBL4000808)
Ki
16±n/a nM
Citation
 Smith, ALWalum, HConnor-Stroud, FFreeman, SMInoue, KParr, LAGoodman, MMYoung, LJ An evaluation of central penetration from a peripherally administered oxytocin receptor selective antagonist in nonhuman primates. Bioorg Med Chem 25:305-315 (2017)  
Target
Name:
Oxytocin receptor
Synonyms:
OT-R OXYR_HUMAN | Oxytocin
Type:
Enzyme Catalytic Domain
Mol. Mass.:
42793.26
Organism:
Homo sapiens (Human)
Description:
Oxytocin OXTR HEK293::B2R9L7
Residue:
389
  
Inhibitor
Name:
BDBM50380759
Synonyms:
CHEMBL2017869
Type:
Small organic molecule
Emp. Form.:
C30H38FN3O6S
Mol. Mass.:
587.703
SMILES:
CS(=O)(=O)N1CCC(CC1)Oc1ccc(CC(=O)N2CCC(CC2)N2C(=O)CCc3ccccc23)c(OCCF)c1
: