Target
Oxytocin receptor
Ligand
BDBM50233853
Substrate
Meas. Tech.
ChEMBL_1651553 (CHEMBL4000808)
Ki
17±n/a nM
Citation
 Smith, ALWalum, HConnor-Stroud, FFreeman, SMInoue, KParr, LAGoodman, MMYoung, LJ An evaluation of central penetration from a peripherally administered oxytocin receptor selective antagonist in nonhuman primates. Bioorg Med Chem 25:305-315 (2017)  
Target
Name:
Oxytocin receptor
Synonyms:
OT-R OXYR_HUMAN | Oxytocin
Type:
Enzyme Catalytic Domain
Mol. Mass.:
42793.26
Organism:
Homo sapiens (Human)
Description:
Oxytocin OXTR HEK293::B2R9L7
Residue:
389
  
Inhibitor
Name:
BDBM50233853
Synonyms:
CHEMBL3392901
Type:
Small organic molecule
Emp. Form.:
C26H42N4O5S2
Mol. Mass.:
554.765
SMILES:
Cc1ccccc1N1CCN(CC1)S(=O)(=O)CC12CCC(CC1NC(=O)C(N)CCS(C)(=O)=O)C2(C)C
: