Target
Dynamin-2
Ligand
BDBM50234000
Substrate
Meas. Tech.
ChEMBL_1651873 (CHEMBL4001128)
IC50
47400±n/a nM
Citation
 Odell, LRAbdel-Hamid, MKHill, TAChau, NYoung, KADeane, FMSakoff, JAAndersson, SDaniel, JARobinson, PJMcCluskey, A Pyrimidine-Based Inhibitors of Dynamin I GTPase Activity: Competitive Inhibition at the Pleckstrin Homology Domain. J Med Chem 60:349-361 (2017)  
Target
Name:
Dynamin-2
Synonyms:
DNM2 DYN2_HUMAN
Type:
PROTEIN
Mol. Mass.:
98071.19
Organism:
Homo sapiens (Human)
Description:
ChEMBL_934670
Residue:
870
  
Inhibitor
Name:
BDBM50234000
Synonyms:
CHEMBL4064810
Type:
Small organic molecule
Emp. Form.:
C15H29N5
Mol. Mass.:
279.4243
SMILES:
CCCCCCNc1nc(C)cc(NCCN(C)C)n1
: