Target
Dynamin-2
Ligand
BDBM50233983
Substrate
Meas. Tech.
ChEMBL_1651871 (CHEMBL4001126)
IC50
1300±n/a nM
Citation
 Odell, LRAbdel-Hamid, MKHill, TAChau, NYoung, KADeane, FMSakoff, JAAndersson, SDaniel, JARobinson, PJMcCluskey, A Pyrimidine-Based Inhibitors of Dynamin I GTPase Activity: Competitive Inhibition at the Pleckstrin Homology Domain. J Med Chem 60:349-361 (2017)  
Target
Name:
Dynamin-2
Synonyms:
DNM2 DYN2_HUMAN
Type:
PROTEIN
Mol. Mass.:
98071.19
Organism:
Homo sapiens (Human)
Description:
ChEMBL_934670
Residue:
870
  
Inhibitor
Name:
BDBM50233983
Synonyms:
CHEMBL4073116
Type:
Small organic molecule
Emp. Form.:
C19H36N4
Mol. Mass.:
320.5159
SMILES:
CCCCCCCCCCCCNc1nc(C)cc(n1)N(C)C
: