Target
Carbonic anhydrase 2
Ligand
BDBM10860
Substrate
Meas. Tech.
ChEMBL_1652371 (CHEMBL4001626)
Ki
170±n/a nM
Citation
 Del Prete, SVullo, DDi Fonzo, POsman, SMAlOthman, ZDonald, WASupuran, CTCapasso, C Sulfonamide inhibition profile of theż-carbonic anhydrase identified in the genome of the pathogenic bacterium Burkholderia pseudomallei the etiological agent responsible of melioidosis. Bioorg Med Chem Lett 27:490-495 (2017)  
Target
Name:
Carbonic anhydrase 2
Synonyms:
CA-II CAC Carbonate dehydratase II Carbonic anhydrase 2 (CA-II) Carbonic anhydrase C Carbonic anhydrase II (CA-II) Carbonic anhydrase II (hCA II) | Carbonic anhydrase isoenzyme II (hCA II)
Type:
Enzyme
Mol. Mass.:
29250.71
Organism:
Homo sapiens (Human)
Description:
P00918
Residue:
260
  
Inhibitor
Name:
BDBM10860
Synonyms:
4-(aminomethyl)benzene-1-sulfonamide MAFENIDE aromatic/heteroaromatic sulfonamide 5 | hCA inhibitor, 9
Type:
Small organic molecule
Emp. Form.:
C7H10N2O2S
Mol. Mass.:
186.232
SMILES:
NCc1ccc(cc1)S(N)(=O)=O
: