Target
Botulinum neurotoxin type A
Ligand
BDBM32203
Substrate
Meas. Tech.
ChEMBL_1652630 (CHEMBL4001885)
IC50
3900±n/a nM
Citation
 Harrell, WAVieira, RCEnsel, SMMontgomery, VGuernieri, REccard, VSCampbell, YRoxas-Duncan, VCardellina, JHWebb, RPSmith, LA A matrix-focused structure-activity and binding site flexibility study of quinolinol inhibitors of botulinum neurotoxin serotype A. Bioorg Med Chem Lett 27:675-678 (2017)  
Target
Name:
Botulinum neurotoxin type A
Synonyms:
BXA1_CLOBO bonT | botA
Type:
PROTEIN
Mol. Mass.:
149450.01
Organism:
Clostridium botulinum
Description:
ChEMBL_1510137
Residue:
1296
  
Inhibitor
Name:
BDBM32203
Synonyms:
8-quinolinol US10005735, Table 1.7 cid_1923 quinolin-8-ol
Type:
Small organic molecule
Emp. Form.:
C9H7NO
Mol. Mass.:
145.158
SMILES:
Oc1cccc2cccnc12
: