Target
Histone deacetylase 7
Ligand
BDBM50235703
Substrate
Meas. Tech.
ChEMBL_1657748 (CHEMBL4007218)
Ki
>50000±n/a nM
Citation
 Meyners, CWolff, BKleinschek, AKrämer, AMeyer-Almes, FJ Perfluorinated hydroxamic acids are potent and selective inhibitors of HDAC-like enzymes from Pseudomonas aeruginosa. Bioorg Med Chem Lett 27:1508-1512 (2017)  
Target
Name:
Histone deacetylase 7
Synonyms:
HD7 HDAC7A Histone acetylase 7 (HDAC7) Human HDAC7
Type:
Chromatin regulator; hydrolase; repressor
Mol. Mass.:
102942.62
Organism:
Homo sapiens (Human)
Description:
Q8WUI4
Residue:
952
  
Inhibitor
Name:
BDBM50235703
Synonyms:
CHEMBL4066515
Type:
Small organic molecule
Emp. Form.:
C16H13F12N3O3
Mol. Mass.:
523.2736
SMILES:
CN(C)c1ccc(NC(=O)C(F)(F)C(F)(F)C(F)(F)C(F)(F)C(F)(F)C(F)(F)C(=O)NO)cc1
: