Target
Histone deacetylase 7
Ligand
BDBM50235701
Substrate
Meas. Tech.
ChEMBL_1657748 (CHEMBL4007218)
Ki
>50000±n/a nM
Citation
 Meyners, CWolff, BKleinschek, AKrämer, AMeyer-Almes, FJ Perfluorinated hydroxamic acids are potent and selective inhibitors of HDAC-like enzymes from Pseudomonas aeruginosa. Bioorg Med Chem Lett 27:1508-1512 (2017)  
Target
Name:
Histone deacetylase 7
Synonyms:
HD7 HDAC7A Histone acetylase 7 (HDAC7) Human HDAC7
Type:
Chromatin regulator; hydrolase; repressor
Mol. Mass.:
102942.62
Organism:
Homo sapiens (Human)
Description:
Q8WUI4
Residue:
952
  
Inhibitor
Name:
BDBM50235701
Synonyms:
CHEMBL4098910
Type:
Small organic molecule
Emp. Form.:
C15H10F12N2O3
Mol. Mass.:
494.2323
SMILES:
Cc1cccc(NC(=O)C(F)(F)C(F)(F)C(F)(F)C(F)(F)C(F)(F)C(F)(F)C(=O)NO)c1
: