Target
Lysine-specific histone demethylase 2
Ligand
BDBM50155773
Substrate
Meas. Tech.
ChEBML_1659184
IC50
12900±n/a nM
Citation
 Vianello, PSartori, LAmigoni, FCappa, AFagá, GFattori, RLegnaghi, ECiossani, GMattevi, AMeroni, GMoretti, LCecatiello, VPasqualato, SRomussi, AThaler, FTrifiró, PVilla, MBotrugno, OADessanti, PMinucci, SVultaggio, SZagarrí, EVarasi, MMercurio, C Thieno[3,2-b]pyrrole-5-carboxamides as New Reversible Inhibitors of Histone Lysine Demethylase KDM1A/LSD1. Part 2: Structure-Based Drug Design and Structure-Activity Relationship. J Med Chem 60:1693-1715 (2017)  
Target
Name:
Lysine-specific histone demethylase 2
Synonyms:
AOF1 Flavin-containing amine oxidase domain-containing protein 1 KDM1B_HUMAN Lysine-specific histone demethylase 1B | Lysine-specific histone demethylase 2
Type:
PROTEIN
Mol. Mass.:
92112.91
Organism:
Homo sapiens (Human)
Description:
ChEMBL_992590
Residue:
822
  
Inhibitor
Name:
BDBM50155773
Synonyms:
CHEMBL3781751 | US9469597, 5
Type:
Small organic molecule
Emp. Form.:
C15H22N2
Mol. Mass.:
230.3486
SMILES:
[H][C@@]1(CC[C@H](N)CC1)N[C@@H]1C[C@H]1c1ccccc1
: