Target
Lysine-specific histone demethylase 1A/REST corepressor 1
Ligand
BDBM50155773
Substrate
Meas. Tech.
ChEMBL_1659178 (CHEMBL4008790)
IC50
0.380000±n/a nM
Citation
 Vianello, PSartori, LAmigoni, FCappa, AFagá, GFattori, RLegnaghi, ECiossani, GMattevi, AMeroni, GMoretti, LCecatiello, VPasqualato, SRomussi, AThaler, FTrifiró, PVilla, MBotrugno, OADessanti, PMinucci, SVultaggio, SZagarrí, EVarasi, MMercurio, C Thieno[3,2-b]pyrrole-5-carboxamides as New Reversible Inhibitors of Histone Lysine Demethylase KDM1A/LSD1. Part 2: Structure-Based Drug Design and Structure-Activity Relationship. J Med Chem 60:1693-1715 (2017)  
Target
Name:
Lysine-specific histone demethylase 1A/REST corepressor 1
Synonyms:
LSD1/CoREST complex
Type:
Mol. Mass.:
Description:
ASSAY_ID of ChEMBL is 1659159
Components:
This complex has 2 components.
Component 1
Name:
Lysine-specific histone demethylase 1A
Synonyms:
AOF2 Flavin-containing amine oxidase domain-containing protein 2 KDM1A KIAA0601 Lysine-specific demethylase 1 (LSD1) Lysine-specific histone demethylase 1 (LSD1)
Type:
Enzyme
Mol. Mass.:
92901.01
Organism:
Homo sapiens (Human)
Description:
O60341
Residue:
852
  
Component 2
Name:
REST corepressor 1
Synonyms:
KIAA0071 RCOR RCOR1_HUMAN | REST corepressor 1
Type:
PROTEIN
Mol. Mass.:
53329.34
Organism:
Homo sapiens (Human)
Description:
ChEMBL_108118
Residue:
485
  
Inhibitor
Name:
BDBM50155773
Synonyms:
CHEMBL3781751 | US9469597, 5
Type:
Small organic molecule
Emp. Form.:
C15H22N2
Mol. Mass.:
230.3486
SMILES:
[H][C@@]1(CC[C@H](N)CC1)N[C@@H]1C[C@H]1c1ccccc1
: