Target
Sodium-dependent serotonin transporter
Ligand
BDBM86234
Substrate
Meas. Tech.
ChEMBL_1660354 (CHEMBL4009966)
EC50
340±n/a nM
Citation
 Glennon, RA The 2014 Philip S. Portoghese Medicinal Chemistry Lectureship: The"Phenylalkylaminome" with a Focus on Selected Drugs of Abuse. J Med Chem 60:2605-2628 (2017)  
Target
Name:
Sodium-dependent serotonin transporter
Synonyms:
5-HT Transporter 5HT transporter Anandamid membrane transporter, AMT Monoamine transporters; Norepinephrine & serotonin Slc6a4 Sodium-dependent serotonin transporter (SERT) | imipramine receptor
Type:
Multi-pass membrane protein
Mol. Mass.:
70168.43
Organism:
Rattus norvegicus (rat)
Description:
P31652
Residue:
630
  
Inhibitor
Name:
BDBM86234
Synonyms:
CAS_64057-70-1 NSC_126235
Type:
Small organic molecule
Emp. Form.:
C11H15NO2
Mol. Mass.:
193.2423
SMILES:
CN[C@H](C)Cc1ccc2OCOc2c1
: