Target
Bile salt export pump
Ligand
BDBM50009859
Substrate
Meas. Tech.
ChEBML_1661982
IC50
>135000±n/a nM
Citation
 Morgan, RETrauner, Mvan Staden, CJLee, PHRamachandran, BEschenberg, MAfshari, CAQualls, CWLightfoot-Dunn, RHamadeh, HK Interference with bile salt export pump function is a susceptibility factor for human liver injury in drug development. Toxicol Sci 118:485-500 (2010)  
Target
Name:
Bile salt export pump
Synonyms:
ABCB11 ATP-binding cassette sub-family B member 11 Bile Salt Export Pump, BSEP Bile salt export pump (BSEP)
Type:
Protein
Mol. Mass.:
146405.49
Organism:
Homo sapiens (Human)
Description:
O95342
Residue:
1321
  
Inhibitor
Name:
BDBM50009859
Synonyms:
(+-)-2-(p-isobutylphenyl)propionic acid (+-)-ibuprofen (4-isobutylphenyl)-alpha-methylacetic acid 2-(4-isobutylphenyl)propanoic acid 4-isobutylhydratropic acid Brufen IBUPROFEN LYSINE Ibuprofen (1) alpha-(4-isobutylphenyl)propionic acid | alpha-(p-isobutylphenyl)propionic acid
Type:
Small organic molecule
Emp. Form.:
C13H18O2
Mol. Mass.:
206.2808
SMILES:
CC(C)Cc1ccc(cc1)C(C)C(O)=O
: