Target
Acetylcholinesterase
Ligand
BDBM50238234
Substrate
Meas. Tech.
ChEMBL_1663551 (CHEMBL4013232)
IC50
>1000±n/a nM
Citation
 Peauger, LAzzouz, RGembus, VTîntas, MLSopková-de Oliveira Santos, JBohn, PPapamicaël, CLevacher, V Donepezil-Based Central Acetylcholinesterase Inhibitors by Means of a"Bio-Oxidizable" Prodrug Strategy: Design, Synthesis, and in Vitro Biological Evaluation. J Med Chem 60:5909-5926 (2017)  
Target
Name:
Acetylcholinesterase
Synonyms:
ACES_HUMAN Acetylcholinesterase (AChE) | Acetylcholinesterase (human AChE)
Type:
Enzyme
Mol. Mass.:
67792.70
Organism:
Homo sapiens (Human)
Description:
P22303
Residue:
614
  
Inhibitor
Name:
BDBM50238234
Synonyms:
CHEMBL4101303
Type:
Small organic molecule
Emp. Form.:
C25H25ClN2O4
Mol. Mass.:
452.93
SMILES:
COc1cc2CC(CC3C=CN(Cc4cccc(Cl)c4)C=C3C(N)=O)C(=O)c2cc1OC
: