Target
Adenosine receptor A2a
Ligand
BDBM50238386
Substrate
Meas. Tech.
ChEBML_1663191
Ki
3.5±n/a nM
Citation
 Falsini, MSquarcialupi, LCatarzi, DVarano, FBetti, MDal Ben, DMarucci, GBuccioni, MVolpini, RDe Vita, TCavalli, AColotta, V The 1,2,4-Triazolo[4,3-a]pyrazin-3-one as a Versatile Scaffold for the Design of Potent Adenosine Human Receptor Antagonists. Structural Investigations to Target the A J Med Chem 60:5772-5790 (2017)  
Target
Name:
Adenosine receptor A2a
Synonyms:
A2A adenosine receptor (hA2A) ADENOSINE A2 ADORA2 Adenosine A2A receptor (A2AAR)
Type:
G Protein-Coupled Receptor (GPCR)
Mol. Mass.:
44716.46
Organism:
Homo sapiens (Human)
Description:
P29274
Residue:
412
  
Inhibitor
Name:
BDBM50238386
Synonyms:
CHEMBL4068548
Type:
Small organic molecule
Emp. Form.:
C17H13N5O2
Mol. Mass.:
319.3174
SMILES:
Nc1nc(cn2c1nn(-c1ccccc1)c2=O)-c1cccc(O)c1
: