Target
Proto-oncogene tyrosine-protein kinase Src
Ligand
BDBM50436584
Substrate
Meas. Tech.
ChEMBL_1663822 (CHEMBL4013503)
Ki
60±n/a nM
Citation
 Vignaroli, GIovenitti, GZamperini, CConiglio, FCalandro, PMolinari, AFallacara, ALSartucci, ACalgani, AColecchia, DMancini, AFestuccia, CDreassi, EValoti, MMusumeci, FChiariello, MAngelucci, ABotta, MSchenone, S Prodrugs of Pyrazolo[3,4-d]pyrimidines: From Library Synthesis to Evaluation as Potential Anticancer Agents in an Orthotopic Glioblastoma Model. J Med Chem 60:6305-6320 (2017)  
Target
Name:
Proto-oncogene tyrosine-protein kinase Src
Synonyms:
Calmodulin/Proto-oncogene tyrosine-protein kinase Src Proto-oncogene c-Src SRC SRC_HUMAN V-src sarcoma (Schmidt-Ruppin A-2) viral oncogene homolog (avian) p60-Src | pp60c-src
Type:
Protein
Mol. Mass.:
59838.60
Organism:
Homo sapiens (Human)
Description:
P12931
Residue:
536
  
Inhibitor
Name:
BDBM50436584
Synonyms:
CHEMBL2397802
Type:
Small organic molecule
Emp. Form.:
C19H15BrClN5
Mol. Mass.:
428.713
SMILES:
ClC(Cn1ncc2c(Nc3ccccc3)ncnc12)c1ccc(Br)cc1
: