Target
Potassium voltage-gated channel subfamily H member 2
Ligand
BDBM50238630
Substrate
Meas. Tech.
ChEMBL_1663976 (CHEMBL4013657)
IC50
377±n/a nM
Citation
 Leven, MKnaab, TCHeld, JDuffy, SMeister, SFischli, CMeitzner, DLehmann, ULungerich, BKuna, KStahlke, PDelves, MJBuchholz, MWinzeler, EAAvery, VMMordmüller, BWittlin, SKurz, T 3-Hydroxy-N'-arylidenepropanehydrazonamides with Halo-Substituted Phenanthrene Scaffolds Cure P. berghei Infected Mice When Administered Perorally. J Med Chem 60:6036-6044 (2017)  
Target
Name:
Potassium voltage-gated channel subfamily H member 2
Synonyms:
1,3-beta-glucan synthase component GLS2 ERG Eag-related protein 1 Ether-a-go-go-related gene (HERG) Ether-a-go-go-related gene potassium channel 1 Ether-a-go-go-related gene potassium channel 1 (hERG1) Ether-a-go-go-related protein 1 H-ERG KCNH2 Potassium voltage-gated channel subfamily H member 2 (hERG) Voltage-gated potassium channel subunit Kv11.1 hERG Potassium Channel 1 | putative potassium channel subunit
Type:
Multi-pass membrane protein
Mol. Mass.:
126672.65
Organism:
Homo sapiens (Human)
Description:
Q12809
Residue:
1159
  
Inhibitor
Name:
BDBM50238630
Synonyms:
CHEBI:156095 | Lumefantrine
Type:
Small organic molecule
Emp. Form.:
C30H32Cl3NO
Mol. Mass.:
528.94
SMILES:
CCCCN(CCCC)CC(O)c1cc(Cl)cc2\C(=C/c3ccc(Cl)cc3)c3cc(Cl)ccc3-c12
: