Target
Carbonic anhydrase 12
Ligand
BDBM50144806
Substrate
Meas. Tech.
ChEMBL_1664112 (CHEMBL4013793)
Ki
3.4±n/a nM
Citation
 Falsini, MSquarcialupi, LCatarzi, DVarano, FBetti, MDi Cesare Mannelli, LTenci, BGhelardini, CTanc, MAngeli, ASupuran, CTColotta, V 3-Hydroxy-1H-quinazoline-2,4-dione as a New Scaffold To Develop Potent and Selective Inhibitors of the Tumor-Associated Carbonic Anhydrases IX and XII. J Med Chem 60:6428-6439 (2017)  
Target
Name:
Carbonic anhydrase 12
Synonyms:
CA-XII CAH12_HUMAN Carbonic anhydrase Carbonic anhydrase XII Carbonic anhydrase XII (CAXII) | Tumor antigen HOM-RCC-3.1.3
Type:
Enzyme
Mol. Mass.:
39456.00
Organism:
Homo sapiens (Human)
Description:
Catalytic domain of human cloned isozyme was used in the assay
Residue:
354
  
Inhibitor
Name:
BDBM50144806
Synonyms:
7-Chloro-3-hydroxy-1H-quinazoline-2,4-dione CHEMBL80594
Type:
Small organic molecule
Emp. Form.:
C8H5ClN2O3
Mol. Mass.:
212.59
SMILES:
On1c(=O)[nH]c2cc(Cl)ccc2c1=O
: